Target
Serine/threonine-protein kinase D1
Ligand
BDBM32361
Substrate
Meas. Tech.
Fluorescence polarization assay for PKD inhibitiors-interference assay-57K HTS campaign
IC50
>50000±n/a nM
Citation
 PubChem, PC Fluorescence polarization assay for PKD inhibitiors-interference assay-57K HTS campaign PubChem Bioassay (2008)[AID] 
Target
Name:
Serine/threonine-protein kinase D1
Synonyms:
KPCD1_HUMAN PKD1 PRKD1 Protein kinase C mu type Protein kinase C, PKC; classical/novel Protein kinase D (PRKD1) nPKC-D1 | nPKC-mu
Type:
Serine/threonine-protein kinase
Mol. Mass.:
101705.07
Organism:
Homo sapiens (Human)
Description:
gi_115529463
Residue:
912
  
Inhibitor
Name:
BDBM32361
Synonyms:
2-[4-[(4-keto-6-propyl-1H-pyrimidin-2-yl)thio]butyl]isoindoline-1,3-quinone 2-[4-[(4-oxo-6-propyl-1H-pyrimidin-2-yl)sulfanyl]butyl]isoindole-1,3-dione MLS000761528 cid_2097425
Type:
Small organic molecule
Emp. Form.:
C19H21N3O3S
Mol. Mass.:
371.453
SMILES:
CCCc1cc(=O)[nH]c(SCCCCN2C(=O)c3ccccc3C2=O)n1
: