Target
Signal transducer and activator of transcription 3 [702-738,740-752]
Ligand
BDBM50240982
Substrate
Meas. Tech.
Dose response cell-based assay to measure STAT3 inhibition
IC50
5252±n/a nM
Citation
 PubChem, PC Dose response cell-based assay to measure STAT3 inhibition PubChem Bioassay (2008)[AID] 
Target
Name:
Signal transducer and activator of transcription 3 [702-738,740-752]
Synonyms:
APRF STAT3_HUMAN
Type:
Enzyme Catalytic Domain
Mol. Mass.:
5263.93
Organism:
Homo sapiens (Human)
Description:
gi_13272532
Residue:
50
  
Inhibitor
Name:
BDBM50240982
Synonyms:
(E)-(7S,11S)-2,4,11-Trihydroxy-7-methyl-7,8,9,10,11,12,13,14-octahydro-6-oxa-benzocyclotetradecen-5-one CHEMBL372840 | cid_107645
Type:
Small organic molecule
Emp. Form.:
C18H24O5
Mol. Mass.:
320.3802
SMILES:
C[C@H]1CCC[C@@H](O)CCC\C=C\c2cc(O)cc(O)c2C(=O)O1
: