Target
Signal transducer and activator of transcription 3 [702-738,740-752]
Ligand
BDBM46362
Substrate
Meas. Tech.
Dose response cell-based assay to measure STAT3 inhibition
IC50
5732±n/a nM
Citation
 PubChem, PC Dose response cell-based assay to measure STAT3 inhibition PubChem Bioassay (2008)[AID] 
Target
Name:
Signal transducer and activator of transcription 3 [702-738,740-752]
Synonyms:
APRF STAT3_HUMAN
Type:
Enzyme Catalytic Domain
Mol. Mass.:
5263.93
Organism:
Homo sapiens (Human)
Description:
gi_13272532
Residue:
50
  
Inhibitor
Name:
BDBM46362
Synonyms:
1-[4-(2-methylphenoxy)butyl]-1H-benzimidazole MLS000536309 cid_2129703
Type:
Small organic molecule
Emp. Form.:
C18H20N2O
Mol. Mass.:
280.3642
SMILES:
Cc1ccccc1OCCCCn1cnc2ccccc12
: