Target
Signal transducer and activator of transcription 3 [702-738,740-752]
Ligand
BDBM46374
Substrate
Meas. Tech.
Dose response cell-based assay to measure STAT3 inhibition
IC50
1288±n/a nM
Citation
 PubChem, PC Dose response cell-based assay to measure STAT3 inhibition PubChem Bioassay (2008)[AID] 
Target
Name:
Signal transducer and activator of transcription 3 [702-738,740-752]
Synonyms:
APRF STAT3_HUMAN
Type:
Enzyme Catalytic Domain
Mol. Mass.:
5263.93
Organism:
Homo sapiens (Human)
Description:
gi_13272532
Residue:
50
  
Inhibitor
Name:
BDBM46374
Synonyms:
1-(1-acetyl-2,3-dihydroindol-5-yl)-4-hydroxy-3-pyrazolecarboxylic acid methyl ester MLS000565173 cid_705951 methyl 1-(1-ethanoyl-2,3-dihydroindol-5-yl)-4-oxidanyl-pyrazole-3-carboxylate
Type:
Small organic molecule
Emp. Form.:
C15H15N3O4
Mol. Mass.:
301.2973
SMILES:
COC(=O)c1nn(cc1O)-c1ccc2N(CCc2c1)C(C)=O
: