Target
Signal transducer and activator of transcription 3 [702-738,740-752]
Ligand
BDBM43521
Substrate
Meas. Tech.
Dose response counterscreen for STAT1 inhibitors: cell-based high throughput assay to measure STAT3 inhibition
IC50
>55700±n/a nM
Citation
 PubChem, PC Dose response counterscreen for STAT1 inhibitors: cell-based high throughput assay to measure STAT3 inhibition PubChem Bioassay (2008)[AID] 
Target
Name:
Signal transducer and activator of transcription 3 [702-738,740-752]
Synonyms:
APRF STAT3_HUMAN
Type:
Enzyme Catalytic Domain
Mol. Mass.:
5263.93
Organism:
Homo sapiens (Human)
Description:
gi_13272532
Residue:
50
  
Inhibitor
Name:
BDBM43521
Synonyms:
MLS000394345 N-(4-fluorophenyl)-2-[4-(4-methylphenyl)sulfonylpiperazin-1-yl]-2-phenyl-ethanamide N-(4-fluorophenyl)-2-phenyl-2-(4-tosylpiperazino)acetamide cid_15945370
Type:
Small organic molecule
Emp. Form.:
C25H26FN3O3S
Mol. Mass.:
467.556
SMILES:
Cc1ccc(cc1)S(=O)(=O)N1CCN(CC1)C(C(=O)Nc1ccc(F)cc1)c1ccccc1
: