Target
Signal transducer and activator of transcription 3 [702-738,740-752]
Ligand
BDBM43532
Substrate
Meas. Tech.
Dose response counterscreen for STAT1 inhibitors: cell-based high throughput assay to measure STAT3 inhibition
IC50
>55700±n/a nM
Citation
 PubChem, PC Dose response counterscreen for STAT1 inhibitors: cell-based high throughput assay to measure STAT3 inhibition PubChem Bioassay (2008)[AID] 
Target
Name:
Signal transducer and activator of transcription 3 [702-738,740-752]
Synonyms:
APRF STAT3_HUMAN
Type:
Enzyme Catalytic Domain
Mol. Mass.:
5263.93
Organism:
Homo sapiens (Human)
Description:
gi_13272532
Residue:
50
  
Inhibitor
Name:
BDBM43532
Synonyms:
11,11-dimethyl-3-(pyrrolidine-1-carbonyl)-10H-naphth[1,2-g]indolizine-1,2-quinone 11,11-dimethyl-3-[oxo(1-pyrrolidinyl)methyl]-10H-naphtho[1,2-g]indolizine-1,2-dione 6,6-dimethyl-10-(pyrrolidin-1-ylcarbonyl)-5,6-dihydrobenzo[f]pyrrolo[2,1-a]isoquinoline-8,9-dione SMR000307157 | cid_5026241
Type:
Small organic molecule
Emp. Form.:
C23H22N2O3
Mol. Mass.:
374.4324
SMILES:
CC1(C)Cc2c(ccc3ccccc23)C2=C(C(=O)N3CCCC3)C(=O)C(=O)N12
: