Target
Signal transducer and activator of transcription 1-alpha/beta
Ligand
BDBM46336
Substrate
Meas. Tech.
Dose response counterscreen assay for STAT3 inhibitors: cell-based high throughput assay to measure STAT1 inhibition
IC50
>55700±n/a nM
Citation
 PubChem, PC Dose response counterscreen assay for STAT3 inhibitors: cell-based high throughput assay to measure STAT1 inhibition PubChem Bioassay (2008)[AID] 
Target
Name:
Signal transducer and activator of transcription 1-alpha/beta
Synonyms:
STAT1 Signal transducer and activator of transcription 1-alpha/beta Transcription factor ISGF-3 components p91/p84 | signal transducer and activator of transcription 1 isoform alpha
Type:
Cytosolic Transcription Factor
Mol. Mass.:
87327.69
Organism:
Homo sapiens (Human)
Description:
Stat1 was expressed in sf9 cells from a baculovirus encoding the recombinant proteins. Stat1 dimer binds to DNA.
Residue:
750
  
Inhibitor
Name:
BDBM46336
Synonyms:
3-[2-(3-Methyl-3H-imidazo[4,5-b]pyridin-2-ylsulfanyl)-acetylamino]-benzoic acid methyl ester 3-[[2-[(3-methylimidazo[4,5-b]pyridin-2-yl)thio]acetyl]amino]benzoic acid methyl ester SMR000005799 methyl 3-[2-(3-methylimidazo[4,5-b]pyridin-2-yl)sulfanylethanoylamino]benzoate | methyl 3-[[2-(3-methylimidazo[4,5-b]pyridin-2-yl)sulfanylacetyl]amino]benzoate
Type:
Small organic molecule
Emp. Form.:
C17H16N4O3S
Mol. Mass.:
356.399
SMILES:
COC(=O)c1cccc(NC(=O)CSc2nc3cccnc3n2C)c1
: