Target
Signal transducer and activator of transcription 1-alpha/beta
Ligand
BDBM39003
Substrate
Meas. Tech.
Dose response counterscreen assay for STAT3 inhibitors: cell-based high throughput assay to measure STAT1 inhibition
IC50
47680±n/a nM
Citation
 PubChem, PC Dose response counterscreen assay for STAT3 inhibitors: cell-based high throughput assay to measure STAT1 inhibition PubChem Bioassay (2008)[AID] 
Target
Name:
Signal transducer and activator of transcription 1-alpha/beta
Synonyms:
STAT1 Signal transducer and activator of transcription 1-alpha/beta Transcription factor ISGF-3 components p91/p84 | signal transducer and activator of transcription 1 isoform alpha
Type:
Cytosolic Transcription Factor
Mol. Mass.:
87327.69
Organism:
Homo sapiens (Human)
Description:
Stat1 was expressed in sf9 cells from a baculovirus encoding the recombinant proteins. Stat1 dimer binds to DNA.
Residue:
750
  
Inhibitor
Name:
BDBM39003
Synonyms:
5-[(1,3-dimethyl-2-oxo-5-benzimidazolyl)sulfamoyl]-3-methyl-2-benzofurancarboxylic acid ethyl ester MLS000052229 cid_1253477 ethyl 5-[(1,3-dimethyl-2-oxobenzimidazol-5-yl)sulfamoyl]-3-methyl-1-benzofuran-2-carboxylate | ethyl 5-{[(1,3-dimethyl-2-oxo-2,3-dihydro-1H-benzimidazol-5-yl)amino]sulfonyl}-3-methyl-1-benzofuran-2-carboxylate
Type:
Small organic molecule
Emp. Form.:
C21H21N3O6S
Mol. Mass.:
443.473
SMILES:
CCOC(=O)c1oc2ccc(cc2c1C)S(=O)(=O)Nc1ccc2n(C)c(=O)n(C)c2c1
: