Target
Signal transducer and activator of transcription 1-alpha/beta
Ligand
BDBM46365
Substrate
Meas. Tech.
Dose response counterscreen assay for STAT3 inhibitors: cell-based high throughput assay to measure STAT1 inhibition
IC50
>55700±n/a nM
Citation
 PubChem, PC Dose response counterscreen assay for STAT3 inhibitors: cell-based high throughput assay to measure STAT1 inhibition PubChem Bioassay (2008)[AID] 
Target
Name:
Signal transducer and activator of transcription 1-alpha/beta
Synonyms:
STAT1 Signal transducer and activator of transcription 1-alpha/beta Transcription factor ISGF-3 components p91/p84 | signal transducer and activator of transcription 1 isoform alpha
Type:
Cytosolic Transcription Factor
Mol. Mass.:
87327.69
Organism:
Homo sapiens (Human)
Description:
Stat1 was expressed in sf9 cells from a baculovirus encoding the recombinant proteins. Stat1 dimer binds to DNA.
Residue:
750
  
Inhibitor
Name:
BDBM46365
Synonyms:
MLS000531723 N-(4-{[4-(1,3-benzodioxol-5-ylmethyl)-1-piperazinyl]carbonyl}phenyl)-N,4-dimethylbenzenesulfonamide N-[4-[4-(1,3-benzodioxol-5-ylmethyl)piperazine-1-carbonyl]phenyl]-N,4-dimethylbenzenesulfonamide SMR000136701 | cid_1304330
Type:
Small organic molecule
Emp. Form.:
C27H29N3O5S
Mol. Mass.:
507.601
SMILES:
CN(c1ccc(cc1)C(=O)N1CCN(Cc2ccc3OCOc3c2)CC1)S(=O)(=O)c1ccc(C)cc1
: