Target
Signal transducer and activator of transcription 1-alpha/beta
Ligand
BDBM46370
Substrate
Meas. Tech.
Dose response counterscreen assay for STAT3 inhibitors: cell-based high throughput assay to measure STAT1 inhibition
IC50
>55700±n/a nM
Citation
 PubChem, PC Dose response counterscreen assay for STAT3 inhibitors: cell-based high throughput assay to measure STAT1 inhibition PubChem Bioassay (2008)[AID] 
Target
Name:
Signal transducer and activator of transcription 1-alpha/beta
Synonyms:
STAT1 Signal transducer and activator of transcription 1-alpha/beta Transcription factor ISGF-3 components p91/p84 | signal transducer and activator of transcription 1 isoform alpha
Type:
Cytosolic Transcription Factor
Mol. Mass.:
87327.69
Organism:
Homo sapiens (Human)
Description:
Stat1 was expressed in sf9 cells from a baculovirus encoding the recombinant proteins. Stat1 dimer binds to DNA.
Residue:
750
  
Inhibitor
Name:
BDBM46370
Synonyms:
2-(4-bromanyl-3,5-dimethyl-phenoxy)-N-pyridin-4-yl-ethanamide 2-(4-bromo-3,5-dimethylphenoxy)-N-4-pyridinylacetamide MLS000534662 cid_803320
Type:
Small organic molecule
Emp. Form.:
C15H15BrN2O2
Mol. Mass.:
335.196
SMILES:
Cc1cc(OCC(=O)Nc2ccncc2)cc(C)c1Br
: