Target
Signal transducer and activator of transcription 1-alpha/beta
Ligand
BDBM46392
Substrate
Meas. Tech.
Dose response counterscreen assay for STAT3 inhibitors: cell-based high throughput assay to measure STAT1 inhibition
IC50
>55700±n/a nM
Citation
 PubChem, PC Dose response counterscreen assay for STAT3 inhibitors: cell-based high throughput assay to measure STAT1 inhibition PubChem Bioassay (2008)[AID] 
Target
Name:
Signal transducer and activator of transcription 1-alpha/beta
Synonyms:
STAT1 Signal transducer and activator of transcription 1-alpha/beta Transcription factor ISGF-3 components p91/p84 | signal transducer and activator of transcription 1 isoform alpha
Type:
Cytosolic Transcription Factor
Mol. Mass.:
87327.69
Organism:
Homo sapiens (Human)
Description:
Stat1 was expressed in sf9 cells from a baculovirus encoding the recombinant proteins. Stat1 dimer binds to DNA.
Residue:
750
  
Inhibitor
Name:
BDBM46392
Synonyms:
2-[(4-propoxybenzyl)thio]-1H-benzimidazole 2-[(4-propoxyphenyl)methylthio]-1H-benzimidazole SMR000198134 | cid_1653621
Type:
Small organic molecule
Emp. Form.:
C17H18N2OS
Mol. Mass.:
298.403
SMILES:
CCCOc1ccc(CSc2nc3ccccc3[nH]2)cc1
: