Target
Signal transducer and activator of transcription 1-alpha/beta
Ligand
BDBM46414
Substrate
Meas. Tech.
Dose response counterscreen assay for STAT3 inhibitors: cell-based high throughput assay to measure STAT1 inhibition
IC50
>55700±n/a nM
Citation
 PubChem, PC Dose response counterscreen assay for STAT3 inhibitors: cell-based high throughput assay to measure STAT1 inhibition PubChem Bioassay (2008)[AID] 
Target
Name:
Signal transducer and activator of transcription 1-alpha/beta
Synonyms:
STAT1 Signal transducer and activator of transcription 1-alpha/beta Transcription factor ISGF-3 components p91/p84 | signal transducer and activator of transcription 1 isoform alpha
Type:
Cytosolic Transcription Factor
Mol. Mass.:
87327.69
Organism:
Homo sapiens (Human)
Description:
Stat1 was expressed in sf9 cells from a baculovirus encoding the recombinant proteins. Stat1 dimer binds to DNA.
Residue:
750
  
Inhibitor
Name:
BDBM46414
Synonyms:
4-(sec-butylthiocarbamoylamino)benzoic acid methyl ester MLS000693126 cid_3192433 | methyl 4-(butan-2-ylcarbamothioylamino)benzoate
Type:
Small organic molecule
Emp. Form.:
C13H18N2O2S
Mol. Mass.:
266.359
SMILES:
CCC(C)NC(=S)Nc1ccc(cc1)C(=O)OC
: