Target
Signal transducer and activator of transcription 1-alpha/beta
Ligand
BDBM46417
Substrate
Meas. Tech.
Dose response counterscreen assay for STAT3 inhibitors: cell-based high throughput assay to measure STAT1 inhibition
IC50
>55700±n/a nM
Citation
 PubChem, PC Dose response counterscreen assay for STAT3 inhibitors: cell-based high throughput assay to measure STAT1 inhibition PubChem Bioassay (2008)[AID] 
Target
Name:
Signal transducer and activator of transcription 1-alpha/beta
Synonyms:
STAT1 Signal transducer and activator of transcription 1-alpha/beta Transcription factor ISGF-3 components p91/p84 | signal transducer and activator of transcription 1 isoform alpha
Type:
Cytosolic Transcription Factor
Mol. Mass.:
87327.69
Organism:
Homo sapiens (Human)
Description:
Stat1 was expressed in sf9 cells from a baculovirus encoding the recombinant proteins. Stat1 dimer binds to DNA.
Residue:
750
  
Inhibitor
Name:
BDBM46417
Synonyms:
1-(2,4-dimethylphenyl)-4-(3-pyridinylmethylthio)pyrazolo[3,4-d]pyrimidine 1-(2,4-dimethylphenyl)-4-(pyridin-3-ylmethylsulfanyl)pyrazolo[3,4-d]pyrimidine SMR000323763 | cid_16194792
Type:
Small organic molecule
Emp. Form.:
C19H17N5S
Mol. Mass.:
347.437
SMILES:
Cc1ccc(c(C)c1)-n1ncc2c(SCc3cccnc3)ncnc12
: