Target
Signal transducer and activator of transcription 1-alpha/beta
Ligand
BDBM46421
Substrate
Meas. Tech.
Dose response counterscreen assay for STAT3 inhibitors: cell-based high throughput assay to measure STAT1 inhibition
IC50
>55700±n/a nM
Citation
 PubChem, PC Dose response counterscreen assay for STAT3 inhibitors: cell-based high throughput assay to measure STAT1 inhibition PubChem Bioassay (2008)[AID] 
Target
Name:
Signal transducer and activator of transcription 1-alpha/beta
Synonyms:
STAT1 Signal transducer and activator of transcription 1-alpha/beta Transcription factor ISGF-3 components p91/p84 | signal transducer and activator of transcription 1 isoform alpha
Type:
Cytosolic Transcription Factor
Mol. Mass.:
87327.69
Organism:
Homo sapiens (Human)
Description:
Stat1 was expressed in sf9 cells from a baculovirus encoding the recombinant proteins. Stat1 dimer binds to DNA.
Residue:
750
  
Inhibitor
Name:
BDBM46421
Synonyms:
4-(4-methylphenoxy)-N-(4-pyridinylmethyl)benzenecarboxamide 4-(4-methylphenoxy)-N-(pyridin-4-ylmethyl)benzamide SMR000337350 | cid_4358655
Type:
Small organic molecule
Emp. Form.:
C20H18N2O2
Mol. Mass.:
318.3691
SMILES:
Cc1ccc(Oc2ccc(cc2)C(=O)NCc2ccncc2)cc1
: