Target
Alkaline phosphatase, germ cell type
Ligand
BDBM50296457
Substrate
Meas. Tech.
Luminescent assay for HTS discovery of chemical inhibitors of placental alkaline phosphatase confirmation
IC50
5840±n/a nM
Citation
 PubChem, PC Luminescent assay for HTS discovery of chemical inhibitors of placental alkaline phosphatase confirmation PubChem Bioassay (2009)[AID] 
Target
Name:
Alkaline phosphatase, germ cell type
Synonyms:
ALPG ALPPL2 PPBN_HUMAN | placental-like alkaline phosphatase preproprotein
Type:
PROTEIN
Mol. Mass.:
57374.31
Organism:
Homo sapiens (Human)
Description:
ChEMBL_29964
Residue:
532
  
Inhibitor
Name:
BDBM50296457
Synonyms:
1-(3,4-dihydroxyphenyl)-2-(4-(4-methoxyphenyl)-5-p-tolyl-4H-1,2,4-triazol-3-ylthio)ethanone cid_1401217
Type:
Small organic molecule
Emp. Form.:
C24H21N3O4S
Mol. Mass.:
447.506
SMILES:
COc1ccc(cc1)-n1c(SCC(=O)c2ccc(O)c(O)c2)nnc1-c1ccc(C)cc1
: