Target
Sphingosine 1-phosphate receptor 3
Ligand
BDBM31346
Substrate
Meas. Tech.
Dose response cell-based high throughput screening assay for antagonists of the Sphingosine 1-Phosphate Receptor 3 (S1P3)
IC50
>50000±n/a nM
Citation
 PubChem, PC Dose response cell-based high throughput screening assay for antagonists of the Sphingosine 1-Phosphate Receptor 3 (S1P3) PubChem Bioassay (2009)[AID] 
Target
Name:
Sphingosine 1-phosphate receptor 3
Synonyms:
C9orf108 EDG3 S1P receptor 3 S1P3 S1PR3_HUMAN Sphingosine 1-phosphate receptor 3 (S1P3) | Sphingosine 1-phosphate receptor Edg-3
Type:
G Protein-Coupled Receptor (GPCR)
Mol. Mass.:
42278.13
Organism:
Homo sapiens (Human)
Description:
Q99500
Residue:
378
  
Inhibitor
Name:
BDBM31346
Synonyms:
(3E)-3-(6-ketocyclohexa-2,4-dien-1-ylidene)-N-[2-(methylthio)phenyl]isoxazolidine-5-carboxamide (3E)-N-(2-methylsulfanylphenyl)-3-(6-oxocyclohexa-2,4-dien-1-ylidene)-1,2-oxazolidine-5-carboxamide 3-(2-hydroxyphenyl)-N-[2-(methylthio)phenyl]-4,5-dihydro-5-isoxazolecarboxamide SMR000078276 | cid_5771718
Type:
Small organic molecule
Emp. Form.:
C17H16N2O3S
Mol. Mass.:
328.386
SMILES:
CSc1ccccc1NC(=O)C1CC(=NO1)c1ccccc1O
: