Target
Sphingosine 1-phosphate receptor 3
Ligand
BDBM31350
Substrate
Meas. Tech.
Dose response cell-based high throughput screening assay for antagonists of the Sphingosine 1-Phosphate Receptor 3 (S1P3)
IC50
6922±n/a nM
Citation
 PubChem, PC Dose response cell-based high throughput screening assay for antagonists of the Sphingosine 1-Phosphate Receptor 3 (S1P3) PubChem Bioassay (2009)[AID] 
Target
Name:
Sphingosine 1-phosphate receptor 3
Synonyms:
C9orf108 EDG3 S1P receptor 3 S1P3 S1PR3_HUMAN Sphingosine 1-phosphate receptor 3 (S1P3) | Sphingosine 1-phosphate receptor Edg-3
Type:
G Protein-Coupled Receptor (GPCR)
Mol. Mass.:
42278.13
Organism:
Homo sapiens (Human)
Description:
Q99500
Residue:
378
  
Inhibitor
Name:
BDBM31350
Synonyms:
1-(4-nitrophenyl)-N-(p-tolyl)cyclopentanecarboxamide N-(4-methylphenyl)-1-(4-nitrophenyl)-1-cyclopentanecarboxamide N-(4-methylphenyl)-1-(4-nitrophenyl)cyclopentanecarboxamide cid_969623
Type:
Small organic molecule
Emp. Form.:
C19H20N2O3
Mol. Mass.:
324.3737
SMILES:
Cc1ccc(NC(=O)C2(CCCC2)c2ccc(cc2)[N+]([O-])=O)cc1
: