Target
Eukaryotic translation initiation factor 2-alpha kinase 3
Ligand
BDBM46452
Substrate
Meas. Tech.
Dose response cell-based high-throughput screening assay to measure PERK inhibition
EC50
>55700±n/a nM
Citation
 PubChem, PC Dose response cell-based high-throughput screening assay to measure PERK inhibition PubChem Bioassay (2009)[AID] 
Target
Name:
Eukaryotic translation initiation factor 2-alpha kinase 3
Synonyms:
E2AK3_HUMAN HsPEK PERK Pancreatic endoplasmic reticulum kinase (PERK)
Type:
Enzyme
Mol. Mass.:
125190.66
Organism:
Homo sapiens (Human)
Description:
Q9NZJ5
Residue:
1116
  
Inhibitor
Name:
BDBM46452
Synonyms:
5-(benzylthio)-7-(2-furyl)-1,3-dimethyl-pyrimido[4,5-d]pyrimidine-2,4-quinone 7-(2-furanyl)-1,3-dimethyl-5-(phenylmethylthio)pyrimido[4,5-d]pyrimidine-2,4-dione MLS000102401 cid_5310410
Type:
Small organic molecule
Emp. Form.:
C19H16N4O3S
Mol. Mass.:
380.42
SMILES:
Cn1c2nc(nc(SCc3ccccc3)c2c(=O)n(C)c1=O)-c1ccco1
: