Target
Eukaryotic translation initiation factor 2-alpha kinase 3
Ligand
BDBM41585
Substrate
Meas. Tech.
Dose response cell-based high-throughput screening assay to measure PERK inhibition
EC50
>55700±n/a nM
Citation
 PubChem, PC Dose response cell-based high-throughput screening assay to measure PERK inhibition PubChem Bioassay (2009)[AID] 
Target
Name:
Eukaryotic translation initiation factor 2-alpha kinase 3
Synonyms:
E2AK3_HUMAN HsPEK PERK Pancreatic endoplasmic reticulum kinase (PERK)
Type:
Enzyme
Mol. Mass.:
125190.66
Organism:
Homo sapiens (Human)
Description:
Q9NZJ5
Residue:
1116
  
Inhibitor
Name:
BDBM41585
Synonyms:
(E)-4,4-dimethyl-1-(3-nitrophenyl)-2-(1,2,4-triazol-1-yl)-1-penten-3-one 4,4-Dimethyl-1-(3-nitro-phenyl)-2-[1,2,4]triazol-1-yl-pent-1-en-3-one SMR000117706 | cid_5759185
Type:
Small organic molecule
Emp. Form.:
C15H16N4O3
Mol. Mass.:
300.3125
SMILES:
CC(C)(C)C(=O)C(=C/c1cccc(c1)[N+]([O-])=O)\n1cncn1
: