Target
Eukaryotic translation initiation factor 2-alpha kinase 3
Ligand
BDBM46469
Substrate
Meas. Tech.
Dose response cell-based high-throughput screening assay to measure PERK inhibition
EC50
>55700±n/a nM
Citation
 PubChem, PC Dose response cell-based high-throughput screening assay to measure PERK inhibition PubChem Bioassay (2009)[AID] 
Target
Name:
Eukaryotic translation initiation factor 2-alpha kinase 3
Synonyms:
E2AK3_HUMAN HsPEK PERK Pancreatic endoplasmic reticulum kinase (PERK)
Type:
Enzyme
Mol. Mass.:
125190.66
Organism:
Homo sapiens (Human)
Description:
Q9NZJ5
Residue:
1116
  
Inhibitor
Name:
BDBM46469
Synonyms:
2,4-bis(trifluoromethyl)-7-[3-(trifluoromethyl)phenoxy]-1,8-naphthyridine MLS000543291 cid_2768569
Type:
Small organic molecule
Emp. Form.:
C17H7F9N2O
Mol. Mass.:
426.2359
SMILES:
FC(F)(F)c1cccc(Oc2ccc3c(cc(nc3n2)C(F)(F)F)C(F)(F)F)c1
: