Target
Eukaryotic translation initiation factor 2-alpha kinase 3
Ligand
BDBM46481
Substrate
Meas. Tech.
Dose response cell-based high-throughput screening assay to measure PERK inhibition
EC50
>55700±n/a nM
Citation
 PubChem, PC Dose response cell-based high-throughput screening assay to measure PERK inhibition PubChem Bioassay (2009)[AID] 
Target
Name:
Eukaryotic translation initiation factor 2-alpha kinase 3
Synonyms:
E2AK3_HUMAN HsPEK PERK Pancreatic endoplasmic reticulum kinase (PERK)
Type:
Enzyme
Mol. Mass.:
125190.66
Organism:
Homo sapiens (Human)
Description:
Q9NZJ5
Residue:
1116
  
Inhibitor
Name:
BDBM46481
Synonyms:
2-(3-keto-6-morpholinosulfonyl-1,4-benzoxazin-4-yl)-N-(2-pyridylmethyl)acetamide 2-(6-morpholin-4-ylsulfonyl-3-oxo-1,4-benzoxazin-4-yl)-N-(pyridin-2-ylmethyl)acetamide 2-[6-(morpholin-4-ylsulfonyl)-3-oxo-2,3-dihydro-4H-1,4-benzoxazin-4-yl]-N-(pyridin-2-ylmethyl)acetamide SMR000314143 | cid_16189325
Type:
Small organic molecule
Emp. Form.:
C20H22N4O6S
Mol. Mass.:
446.477
SMILES:
O=C(CN1C(=O)COc2ccc(cc12)S(=O)(=O)N1CCOCC1)NCc1ccccn1
: