Target
Eukaryotic translation initiation factor 2-alpha kinase 3
Ligand
BDBM46524
Substrate
Meas. Tech.
Dose response cell-based high-throughput screening assay to measure PERK inhibition
EC50
>55700±n/a nM
Citation
 PubChem, PC Dose response cell-based high-throughput screening assay to measure PERK inhibition PubChem Bioassay (2009)[AID] 
Target
Name:
Eukaryotic translation initiation factor 2-alpha kinase 3
Synonyms:
E2AK3_HUMAN HsPEK PERK Pancreatic endoplasmic reticulum kinase (PERK)
Type:
Enzyme
Mol. Mass.:
125190.66
Organism:
Homo sapiens (Human)
Description:
Q9NZJ5
Residue:
1116
  
Inhibitor
Name:
BDBM46524
Synonyms:
19-(hydroxymethyl)-6,18-dimethoxy-1,3,11,12,14,15,16,17,18,19,20,21-dodecahydroyohimban-17-ol MLS000736869 SMR000528357 | cid_3430748
Type:
Small organic molecule
Emp. Form.:
C22H30N2O4
Mol. Mass.:
386.4846
SMILES:
COC1C(O)CC2CN3CCc4c([nH]c5cc(OC)ccc45)C3CC2C1CO
: