Target
Eukaryotic translation initiation factor 2-alpha kinase 3
Ligand
BDBM46535
Substrate
Meas. Tech.
Dose response cell-based high-throughput screening assay to measure PERK inhibition
EC50
>55700±n/a nM
Citation
 PubChem, PC Dose response cell-based high-throughput screening assay to measure PERK inhibition PubChem Bioassay (2009)[AID] 
Target
Name:
Eukaryotic translation initiation factor 2-alpha kinase 3
Synonyms:
E2AK3_HUMAN HsPEK PERK Pancreatic endoplasmic reticulum kinase (PERK)
Type:
Enzyme
Mol. Mass.:
125190.66
Organism:
Homo sapiens (Human)
Description:
Q9NZJ5
Residue:
1116
  
Inhibitor
Name:
BDBM46535
Synonyms:
(1Z)-1-(4-bromanylpyrazol-3-ylidene)-N-[(2-methylphenyl)methoxy]methanamine (1Z)-1-(4-bromopyrazol-3-ylidene)-N-[(2-methylphenyl)methoxy]methanamine MLS000861414 [(Z)-(4-bromopyrazol-3-ylidene)methyl]-(2-methylbenzyl)oxy-amine | cid_16667390
Type:
Small organic molecule
Emp. Form.:
C12H12BrN3O
Mol. Mass.:
294.147
SMILES:
Cc1ccccc1CON=Cc1[nH]ncc1Br
: