Target
Eukaryotic translation initiation factor 2-alpha kinase 3
Ligand
BDBM46539
Substrate
Meas. Tech.
Dose response cell-based high-throughput screening assay to measure PERK inhibition
EC50
>55700±n/a nM
Citation
 PubChem, PC Dose response cell-based high-throughput screening assay to measure PERK inhibition PubChem Bioassay (2009)[AID] 
Target
Name:
Eukaryotic translation initiation factor 2-alpha kinase 3
Synonyms:
E2AK3_HUMAN HsPEK PERK Pancreatic endoplasmic reticulum kinase (PERK)
Type:
Enzyme
Mol. Mass.:
125190.66
Organism:
Homo sapiens (Human)
Description:
Q9NZJ5
Residue:
1116
  
Inhibitor
Name:
BDBM46539
Synonyms:
3-(tert-butyl)-1-methyl-4,5-dihydro-1H-pyrazol-5-one 5-tert-butyl-2-methyl-4H-pyrazol-3-one SMR000457222 | cid_2735686
Type:
Small organic molecule
Emp. Form.:
C8H14N2O
Mol. Mass.:
154.2096
SMILES:
Cn1[nH]c(cc1=O)C(C)(C)C
: