Target
Eukaryotic translation initiation factor 2-alpha kinase 3
Ligand
BDBM46542
Substrate
Meas. Tech.
Dose response cell-based high-throughput screening assay to measure PERK inhibition
EC50
>55700±n/a nM
Citation
 PubChem, PC Dose response cell-based high-throughput screening assay to measure PERK inhibition PubChem Bioassay (2009)[AID] 
Target
Name:
Eukaryotic translation initiation factor 2-alpha kinase 3
Synonyms:
E2AK3_HUMAN HsPEK PERK Pancreatic endoplasmic reticulum kinase (PERK)
Type:
Enzyme
Mol. Mass.:
125190.66
Organism:
Homo sapiens (Human)
Description:
Q9NZJ5
Residue:
1116
  
Inhibitor
Name:
BDBM46542
Synonyms:
1-[1-methyl-3-(trifluoromethyl)-4-pyrazolyl]-3-[4-(trifluoromethyl)phenyl]urea MLS000851470 SMR000457913 | cid_2807796
Type:
Small organic molecule
Emp. Form.:
C13H10F6N4O
Mol. Mass.:
352.2351
SMILES:
Cn1cc(NC(=O)Nc2ccc(cc2)C(F)(F)F)c(n1)C(F)(F)F
: