Target
Eukaryotic translation initiation factor 2-alpha kinase 3
Ligand
BDBM46544
Substrate
Meas. Tech.
Dose response cell-based high-throughput screening assay to measure PERK inhibition
EC50
>55700±n/a nM
Citation
 PubChem, PC Dose response cell-based high-throughput screening assay to measure PERK inhibition PubChem Bioassay (2009)[AID] 
Target
Name:
Eukaryotic translation initiation factor 2-alpha kinase 3
Synonyms:
E2AK3_HUMAN HsPEK PERK Pancreatic endoplasmic reticulum kinase (PERK)
Type:
Enzyme
Mol. Mass.:
125190.66
Organism:
Homo sapiens (Human)
Description:
Q9NZJ5
Residue:
1116
  
Inhibitor
Name:
BDBM46544
Synonyms:
4-[[2-methyl-4-phenyl-5-(trifluoromethyl)-3-pyrazolyl]amino]-4-oxobutanoic acid 4-[[2-methyl-4-phenyl-5-(trifluoromethyl)pyrazol-3-yl]amino]-4-oxobutanoic acid 4-{[1-methyl-4-phenyl-3-(trifluoromethyl)-1H-pyrazol-5-yl]amino}-4-oxobutanoic acid SMR000456963 | cid_2741013
Type:
Small organic molecule
Emp. Form.:
C15H14F3N3O3
Mol. Mass.:
341.2852
SMILES:
Cn1nc(c(c1NC(=O)CCC(O)=O)-c1ccccc1)C(F)(F)F
: