Target
Eukaryotic translation initiation factor 2-alpha kinase 3
Ligand
BDBM46453
Substrate
Meas. Tech.
Counterscreen assay for PERK inhibitors: Dose response cell-based high throughput screening assay to measure inhibition of PERK at 6 hours
EC50
>55700±n/a nM
Citation
 PubChem, PC Counterscreen assay for PERK inhibitors: Dose response cell-based high throughput screening assay to measure inhibition of PERK at 6 hours PubChem Bioassay (2009)[AID] 
Target
Name:
Eukaryotic translation initiation factor 2-alpha kinase 3
Synonyms:
E2AK3_HUMAN HsPEK PERK Pancreatic endoplasmic reticulum kinase (PERK)
Type:
Enzyme
Mol. Mass.:
125190.66
Organism:
Homo sapiens (Human)
Description:
Q9NZJ5
Residue:
1116
  
Inhibitor
Name:
BDBM46453
Synonyms:
1,3-benzodioxol-5-yl-(3,5-dimethyl-1-pyrazolyl)methanone MLS000110735 cid_686254
Type:
Small organic molecule
Emp. Form.:
C13H12N2O3
Mol. Mass.:
244.246
SMILES:
Cc1cc(C)n(n1)C(=O)c1ccc2OCOc2c1
: