Target
Eukaryotic translation initiation factor 2-alpha kinase 3
Ligand
BDBM46473
Substrate
Meas. Tech.
Counterscreen assay for PERK inhibitors: Dose response cell-based high throughput screening assay to measure inhibition of PERK at 6 hours
EC50
>55700±n/a nM
Citation
 PubChem, PC Counterscreen assay for PERK inhibitors: Dose response cell-based high throughput screening assay to measure inhibition of PERK at 6 hours PubChem Bioassay (2009)[AID] 
Target
Name:
Eukaryotic translation initiation factor 2-alpha kinase 3
Synonyms:
E2AK3_HUMAN HsPEK PERK Pancreatic endoplasmic reticulum kinase (PERK)
Type:
Enzyme
Mol. Mass.:
125190.66
Organism:
Homo sapiens (Human)
Description:
Q9NZJ5
Residue:
1116
  
Inhibitor
Name:
BDBM46473
Synonyms:
MLS000578790 N'-(1,3-benzothiazol-2-yl)cyclopropanecarbohydrazide cid_872713
Type:
Small organic molecule
Emp. Form.:
C11H11N3OS
Mol. Mass.:
233.29
SMILES:
O=C(NNc1nc2ccccc2s1)C1CC1
: