Target
Eukaryotic translation initiation factor 2-alpha kinase 3
Ligand
BDBM46490
Substrate
Meas. Tech.
Counterscreen assay for PERK inhibitors: Dose response cell-based high throughput screening assay to measure inhibition of PERK at 6 hours
EC50
>55700±n/a nM
Citation
 PubChem, PC Counterscreen assay for PERK inhibitors: Dose response cell-based high throughput screening assay to measure inhibition of PERK at 6 hours PubChem Bioassay (2009)[AID] 
Target
Name:
Eukaryotic translation initiation factor 2-alpha kinase 3
Synonyms:
E2AK3_HUMAN HsPEK PERK Pancreatic endoplasmic reticulum kinase (PERK)
Type:
Enzyme
Mol. Mass.:
125190.66
Organism:
Homo sapiens (Human)
Description:
Q9NZJ5
Residue:
1116
  
Inhibitor
Name:
BDBM46490
Synonyms:
3-(2,4-dimethoxyanilino)-6-methyl-2H-1,2,4-triazin-5-one MLS000716013 cid_756464
Type:
Small organic molecule
Emp. Form.:
C12H14N4O3
Mol. Mass.:
262.2646
SMILES:
COc1ccc(Nc2nnc(C)c(=O)[nH]2)c(OC)c1
: