Target
Eukaryotic translation initiation factor 2-alpha kinase 3
Ligand
BDBM46494
Substrate
Meas. Tech.
Counterscreen assay for PERK inhibitors: Dose response cell-based high throughput screening assay to measure inhibition of PERK at 6 hours
EC50
>55700±n/a nM
Citation
 PubChem, PC Counterscreen assay for PERK inhibitors: Dose response cell-based high throughput screening assay to measure inhibition of PERK at 6 hours PubChem Bioassay (2009)[AID] 
Target
Name:
Eukaryotic translation initiation factor 2-alpha kinase 3
Synonyms:
E2AK3_HUMAN HsPEK PERK Pancreatic endoplasmic reticulum kinase (PERK)
Type:
Enzyme
Mol. Mass.:
125190.66
Organism:
Homo sapiens (Human)
Description:
Q9NZJ5
Residue:
1116
  
Inhibitor
Name:
BDBM46494
Synonyms:
(6Z)-5-azanylidene-6-[[1-(2-fluorophenyl)-2,5-dimethyl-pyrrol-3-yl]methylidene]-3-methylsulfonyl-[1,2,4]thiadiazolo[4,5-a]pyrimidin-7-one (6Z)-6-[[1-(2-fluorophenyl)-2,5-dimethyl-pyrrol-3-yl]methylene]-5-imino-3-mesyl-[1,2,4]thiadiazolo[4,5-a]pyrimidin-7-one (6Z)-6-{[1-(2-fluorophenyl)-2,5-dimethyl-1H-pyrrol-3-yl]methylene}-5-imino-3-(methylsulfonyl)-5,6-dihydro-7H-[1,2,4]thiadiazolo[4,5-a]pyrimidin-7-one SMR000309114 | cid_16194322
Type:
Small organic molecule
Emp. Form.:
C19H16FN5O3S2
Mol. Mass.:
445.49
SMILES:
Cc1cc(\C=C2\C(=N)N3C(SN=C3S(C)(=O)=O)=NC2=O)c(C)n1-c1ccccc1F
: