Target
Eukaryotic translation initiation factor 2-alpha kinase 3
Ligand
BDBM46500
Substrate
Meas. Tech.
Counterscreen assay for PERK inhibitors: Dose response cell-based high throughput screening assay to measure inhibition of PERK at 6 hours
EC50
>55700±n/a nM
Citation
 PubChem, PC Counterscreen assay for PERK inhibitors: Dose response cell-based high throughput screening assay to measure inhibition of PERK at 6 hours PubChem Bioassay (2009)[AID] 
Target
Name:
Eukaryotic translation initiation factor 2-alpha kinase 3
Synonyms:
E2AK3_HUMAN HsPEK PERK Pancreatic endoplasmic reticulum kinase (PERK)
Type:
Enzyme
Mol. Mass.:
125190.66
Organism:
Homo sapiens (Human)
Description:
Q9NZJ5
Residue:
1116
  
Inhibitor
Name:
BDBM46500
Synonyms:
MLS001018675 N-(4-methoxy-6-nitro-1,3-benzothiazol-2-yl)-2,2-dimethyl-propionamide SMR000363193 | cid_2325477
Type:
Small organic molecule
Emp. Form.:
C13H15N3O4S
Mol. Mass.:
309.341
SMILES:
COc1cc(cc2sc(NC(=O)C(C)(C)C)nc12)[N+]([O-])=O
: