Target
Eukaryotic translation initiation factor 2-alpha kinase 3
Ligand
BDBM46508
Substrate
Meas. Tech.
Counterscreen assay for PERK inhibitors: Dose response cell-based high throughput screening assay to measure inhibition of PERK at 6 hours
EC50
>55700±n/a nM
Citation
 PubChem, PC Counterscreen assay for PERK inhibitors: Dose response cell-based high throughput screening assay to measure inhibition of PERK at 6 hours PubChem Bioassay (2009)[AID] 
Target
Name:
Eukaryotic translation initiation factor 2-alpha kinase 3
Synonyms:
E2AK3_HUMAN HsPEK PERK Pancreatic endoplasmic reticulum kinase (PERK)
Type:
Enzyme
Mol. Mass.:
125190.66
Organism:
Homo sapiens (Human)
Description:
Q9NZJ5
Residue:
1116
  
Inhibitor
Name:
BDBM46508
Synonyms:
3-[(3-amino-1-isoindolylidene)amino]benzenesulfonamide 3-[(3-azanylisoindol-1-ylidene)amino]benzenesulfonamide SMR000365491 | cid_5116626
Type:
Small organic molecule
Emp. Form.:
C14H12N4O2S
Mol. Mass.:
300.336
SMILES:
NC1=N\C(=N/c2cccc(c2)S(N)(=O)=O)c2ccccc12
: