Target
Eukaryotic translation initiation factor 2-alpha kinase 3
Ligand
BDBM46547
Substrate
Meas. Tech.
Counterscreen assay for PERK inhibitors: Dose response cell-based high throughput screening assay to measure inhibition of PERK at 6 hours
EC50
>55700±n/a nM
Citation
 PubChem, PC Counterscreen assay for PERK inhibitors: Dose response cell-based high throughput screening assay to measure inhibition of PERK at 6 hours PubChem Bioassay (2009)[AID] 
Target
Name:
Eukaryotic translation initiation factor 2-alpha kinase 3
Synonyms:
E2AK3_HUMAN HsPEK PERK Pancreatic endoplasmic reticulum kinase (PERK)
Type:
Enzyme
Mol. Mass.:
125190.66
Organism:
Homo sapiens (Human)
Description:
Q9NZJ5
Residue:
1116
  
Inhibitor
Name:
BDBM46547
Synonyms:
2-hydroxy-3-methyl-4H-benzo[d]pyrimido[2,1-b][1,3]thiazol-4-one 4-hydroxy-3-methyl-2-pyrimido[2,1-b][1,3]benzothiazolone 4-hydroxy-3-methylpyrimido[2,1-b][1,3]benzothiazol-2-one SMR000460315 | cid_2729656
Type:
Small organic molecule
Emp. Form.:
C11H8N2O2S
Mol. Mass.:
232.258
SMILES:
Cc1c(O)n2c(nc1=O)sc1ccccc21
: