Target
Transitional endoplasmic reticulum ATPase
Ligand
BDBM30722
Substrate
Meas. Tech.
Dose response biochemical high throughput screening assay for inhibitors of the p97 ATPase
IC50
>50000±n/a nM
Citation
 PubChem, PC Dose response biochemical high throughput screening assay for inhibitors of the p97 ATPase PubChem Bioassay (2009)[AID] 
Target
Name:
Transitional endoplasmic reticulum ATPase
Synonyms:
TERA_HUMAN VCP Valosin-containing protein
Type:
Enzyme
Mol. Mass.:
89300.63
Organism:
Homo sapiens (Human)
Description:
P55072
Residue:
806
  
Inhibitor
Name:
BDBM30722
Synonyms:
MLS000068755 N-(1-butyl-3-cyano-pyrrolo[3,2-b]quinoxalin-2-yl)-2-chloranyl-benzamide N-(1-butyl-3-cyanopyrrolo[3,2-b]quinoxalin-2-yl)-2-chlorobenzamide US9045483, 2 | cid_658797
Type:
Small organic molecule
Emp. Form.:
C22H18ClN5O
Mol. Mass.:
403.864
SMILES:
CCCCn1c(NC(=O)c2ccccc2Cl)c(C#N)c2nc3ccccc3nc12
: