Target
Transitional endoplasmic reticulum ATPase
Ligand
BDBM46559
Substrate
Meas. Tech.
Dose response biochemical high throughput screening assay for inhibitors of the p97 ATPase
IC50
>50000±n/a nM
Citation
 PubChem, PC Dose response biochemical high throughput screening assay for inhibitors of the p97 ATPase PubChem Bioassay (2009)[AID] 
Target
Name:
Transitional endoplasmic reticulum ATPase
Synonyms:
TERA_HUMAN VCP Valosin-containing protein
Type:
Enzyme
Mol. Mass.:
89300.63
Organism:
Homo sapiens (Human)
Description:
P55072
Residue:
806
  
Inhibitor
Name:
BDBM46559
Synonyms:
2-(o-toluoylthiocarbamoylamino)benzoic acid methyl ester 2-[[[[(2-methylphenyl)-oxomethyl]amino]-sulfanylidenemethyl]amino]benzoic acid methyl ester SMR000177734 methyl 2-[(2-methylbenzoyl)carbamothioylamino]benzoate | methyl 2-[(2-methylphenyl)carbonylcarbamothioylamino]benzoate
Type:
Small organic molecule
Emp. Form.:
C17H16N2O3S
Mol. Mass.:
328.386
SMILES:
COC(=O)c1ccccc1NC(=S)NC(=O)c1ccccc1C
: