Target
Transitional endoplasmic reticulum ATPase
Ligand
BDBM46585
Substrate
Meas. Tech.
Dose response biochemical high throughput screening assay for inhibitors of the p97 ATPase
IC50
>50000±n/a nM
Citation
 PubChem, PC Dose response biochemical high throughput screening assay for inhibitors of the p97 ATPase PubChem Bioassay (2009)[AID] 
Target
Name:
Transitional endoplasmic reticulum ATPase
Synonyms:
TERA_HUMAN VCP Valosin-containing protein
Type:
Enzyme
Mol. Mass.:
89300.63
Organism:
Homo sapiens (Human)
Description:
P55072
Residue:
806
  
Inhibitor
Name:
BDBM46585
Synonyms:
2-(2-fluorophenyl)-N-(phenylmethyl)-4-quinazolinamine Benzyl-[2-(2-fluoro-phenyl)-quinazolin-4-yl]-amine N-benzyl-2-(2-fluorophenyl)quinazolin-4-amine benzyl-[2-(2-fluorophenyl)quinazolin-4-yl]amine | cid_886813
Type:
Small organic molecule
Emp. Form.:
C21H16FN3
Mol. Mass.:
329.3702
SMILES:
Fc1ccccc1-c1nc(NCc2ccccc2)c2ccccc2n1
: