Target
Mannose-6-phosphate isomerase
Ligand
BDBM33086
Substrate
Meas. Tech.
Confirmation of compounds inhibiting phosphomannose isomerase (PMI) via a fluorescence intensity assay.
IC50
3120±n/a nM
Citation
 PubChem, PC Confirmation of compounds inhibiting phosphomannose isomerase (PMI) via a fluorescence intensity assay. PubChem Bioassay (2010)[AID] 
Target
Name:
Mannose-6-phosphate isomerase
Synonyms:
MPI MPI_HUMAN PMI1
Type:
PROTEIN
Mol. Mass.:
46651.35
Organism:
Homo sapiens (Human)
Description:
ChEMBL_1448919
Residue:
423
  
Inhibitor
Name:
BDBM33086
Synonyms:
(4-chloro-2,5-dimethoxy-phenyl)-(4-chlorodithiazol-5-ylidene)amine 4-chloro-N-(4-chloro-2,5-dimethoxyphenyl)-5-dithiazolimine MLS000519625 cid_602897
Type:
Small organic molecule
Emp. Form.:
C10H8Cl2N2O2S2
Mol. Mass.:
323.219
SMILES:
COc1cc(\N=c2\ssnc2Cl)c(OC)cc1Cl
: