Target
Mannose-6-phosphate isomerase
Ligand
BDBM46695
Substrate
Meas. Tech.
Confirmation of compounds inhibiting phosphomannose isomerase (PMI) via a fluorescence intensity assay.
IC50
3430±n/a nM
Citation
 PubChem, PC Confirmation of compounds inhibiting phosphomannose isomerase (PMI) via a fluorescence intensity assay. PubChem Bioassay (2010)[AID] 
Target
Name:
Mannose-6-phosphate isomerase
Synonyms:
MPI MPI_HUMAN PMI1
Type:
PROTEIN
Mol. Mass.:
46651.35
Organism:
Homo sapiens (Human)
Description:
ChEMBL_1448919
Residue:
423
  
Inhibitor
Name:
BDBM46695
Synonyms:
2-(3-chlorophenyl)-1,2-benzothiazol-3-one cid_13186954
Type:
Small organic molecule
Emp. Form.:
C13H8ClNOS
Mol. Mass.:
261.727
SMILES:
Clc1cccc(c1)-n1sc2ccccc2c1=O
: