Target
Mannose-6-phosphate isomerase
Ligand
BDBM46669
Substrate
Meas. Tech.
Confirmation of compounds inhibiting phosphomannose isomerase (PMI) via a fluorescence intensity assay using a high concentration of mannose 6-phosphate.
IC50
>100000±0 nM
Citation
 PubChem, PC Confirmation of compounds inhibiting phosphomannose isomerase (PMI) via a fluorescence intensity assay using a high concentration of mannose 6-phosphate. PubChem Bioassay (2009)[AID] 
Target
Name:
Mannose-6-phosphate isomerase
Synonyms:
MPI MPI_HUMAN PMI1
Type:
PROTEIN
Mol. Mass.:
46651.35
Organism:
Homo sapiens (Human)
Description:
ChEMBL_1448919
Residue:
423
  
Inhibitor
Name:
BDBM46669
Synonyms:
2-cyclopentyl-6-hydroxy-1,2-benzothiazol-3-one MLS-0315859.0001 | cid_25067461
Type:
Small organic molecule
Emp. Form.:
C12H13NO2S
Mol. Mass.:
235.302
SMILES:
Oc1ccc2c(c1)sn(C1CCCC1)c2=O
: