Target
Mannose-6-phosphate isomerase
Ligand
BDBM46044
Substrate
Meas. Tech.
Confirmation of compounds inhibiting phosphomannose isomerase (PMI) via a fluorescence intensity assay using a high concentration of mannose 6-phosphate.
IC50
14000±695 nM
Citation
 PubChem, PC Confirmation of compounds inhibiting phosphomannose isomerase (PMI) via a fluorescence intensity assay using a high concentration of mannose 6-phosphate. PubChem Bioassay (2009)[AID] 
Target
Name:
Mannose-6-phosphate isomerase
Synonyms:
MPI MPI_HUMAN PMI1
Type:
PROTEIN
Mol. Mass.:
46651.35
Organism:
Homo sapiens (Human)
Description:
ChEMBL_1448919
Residue:
423
  
Inhibitor
Name:
BDBM46044
Synonyms:
3-(3-keto-1,2-benzothiazol-2-yl)benzoic acid methyl ester MLS-0315861.0001 methyl 3-(3-oxidanylidene-1,2-benzothiazol-2-yl)benzoate | methyl 3-(3-oxo-1,2-benzothiazol-2-yl)benzoate
Type:
Small organic molecule
Emp. Form.:
C15H11NO3S
Mol. Mass.:
285.318
SMILES:
COC(=O)c1cccc(c1)-n1sc2ccccc2c1=O
: