Target
Ion channel NompC
Ligand
BDBM46749
Substrate
Meas. Tech.
Dose response cell-based high-throughput screening assay for agonists of the transient receptor potential channel N1 (TRPN1)
EC50
22000±n/a nM
Citation
 PubChem, PC Dose response cell-based high-throughput screening assay for agonists of the transient receptor potential channel N1 (TRPN1) PubChem Bioassay (2010)[AID] 
Target
Name:
Ion channel NompC
Synonyms:
transient receptor potential cation channel, subfamily N, member 1
Type:
Enzyme Catalytic Domain
Mol. Mass.:
175824.78
Organism:
Danio rerio
Description:
Q7T1G6
Residue:
1614
  
Inhibitor
Name:
BDBM46749
Synonyms:
1-acetyl-3-(2,6-dimethyl-4-pyranylidene)-2-indolone 1-acetyl-3-(2,6-dimethylpyran-4-ylidene)indol-2-one 3-(2,6-dimethylpyran-4-ylidene)-1-ethanoyl-indol-2-one SMR000019908 | cid_697318
Type:
Small organic molecule
Emp. Form.:
C17H15NO3
Mol. Mass.:
281.3059
SMILES:
[#6]-[#6](=O)-[#7]-1-[#6](=O)\[#6](-c2ccccc-12)=[#6]-1\[#6]=[#6](-[#6])-[#8]-[#6](-[#6])=[#6]-1
: