Target
Ion channel NompC
Ligand
BDBM46750
Substrate
Meas. Tech.
Dose response cell-based high-throughput screening assay for agonists of the transient receptor potential channel N1 (TRPN1)
EC50
>29900±n/a nM
Citation
 PubChem, PC Dose response cell-based high-throughput screening assay for agonists of the transient receptor potential channel N1 (TRPN1) PubChem Bioassay (2010)[AID] 
Target
Name:
Ion channel NompC
Synonyms:
transient receptor potential cation channel, subfamily N, member 1
Type:
Enzyme Catalytic Domain
Mol. Mass.:
175824.78
Organism:
Danio rerio
Description:
Q7T1G6
Residue:
1614
  
Inhibitor
Name:
BDBM46750
Synonyms:
1,4-bis-(4-methylphenyl)sulfonyl-2-piperazinecarboxylic acid ethyl ester MLS000052120 cid_2974596 ethyl 1,4-bis[(4-methylphenyl)sulfonyl]-2-piperazinecarboxylate
Type:
Small organic molecule
Emp. Form.:
C21H26N2O6S2
Mol. Mass.:
466.571
SMILES:
CCOC(=O)C1CN(CCN1S(=O)(=O)c1ccc(C)cc1)S(=O)(=O)c1ccc(C)cc1
: