Target
Ion channel NompC
Ligand
BDBM46765
Substrate
Meas. Tech.
Dose response cell-based high-throughput screening assay for agonists of the transient receptor potential channel N1 (TRPN1)
EC50
>29900±n/a nM
Citation
 PubChem, PC Dose response cell-based high-throughput screening assay for agonists of the transient receptor potential channel N1 (TRPN1) PubChem Bioassay (2010)[AID] 
Target
Name:
Ion channel NompC
Synonyms:
transient receptor potential cation channel, subfamily N, member 1
Type:
Enzyme Catalytic Domain
Mol. Mass.:
175824.78
Organism:
Danio rerio
Description:
Q7T1G6
Residue:
1614
  
Inhibitor
Name:
BDBM46765
Synonyms:
4-[[2-(benzenesulfonamido)benzoyl]amino]benzoic acid methyl ester MLS000581884 cid_1289514 methyl 4-[[2-(benzenesulfonamido)benzoyl]amino]benzoate | methyl 4-[[2-(phenylsulfonylamino)phenyl]carbonylamino]benzoate
Type:
Small organic molecule
Emp. Form.:
C21H18N2O5S
Mol. Mass.:
410.443
SMILES:
COC(=O)c1ccc(NC(=O)c2ccccc2NS(=O)(=O)c2ccccc2)cc1
: