Target
Ion channel NompC
Ligand
BDBM46781
Substrate
Meas. Tech.
Dose response cell-based high-throughput screening assay for agonists of the transient receptor potential channel N1 (TRPN1)
EC50
>1110±n/a nM
Citation
 PubChem, PC Dose response cell-based high-throughput screening assay for agonists of the transient receptor potential channel N1 (TRPN1) PubChem Bioassay (2010)[AID] 
Target
Name:
Ion channel NompC
Synonyms:
transient receptor potential cation channel, subfamily N, member 1
Type:
Enzyme Catalytic Domain
Mol. Mass.:
175824.78
Organism:
Danio rerio
Description:
Q7T1G6
Residue:
1614
  
Inhibitor
Name:
BDBM46781
Synonyms:
(3R,3aR)-2-benzoyl-3-(4-fluorobenzyl)-5-keto-4-methylene-1,3a-dihydrocyclopenta[c]pyrrole-3-carboxylic acid methyl ester MLS000563758 cid_3247230 methyl (3R,3aR)-3-[(4-fluorophenyl)methyl]-4-methylidene-5-oxidanylidene-2-(phenylcarbonyl)-1,3a-dihydrocyclopenta[c]pyrrole-3-carboxylate
Type:
Small organic molecule
Emp. Form.:
C24H20FNO4
Mol. Mass.:
405.4183
SMILES:
COC(=O)[C@@]1(Cc2ccc(F)cc2)[C@@H]2C(CN1C(=O)c1ccccc1)=CC(=O)C2=C
: