Target
Ion channel NompC
Ligand
BDBM46814
Substrate
Meas. Tech.
Dose response cell-based high-throughput screening assay for agonists of the transient receptor potential channel N1 (TRPN1)
EC50
>9970±n/a nM
Citation
 PubChem, PC Dose response cell-based high-throughput screening assay for agonists of the transient receptor potential channel N1 (TRPN1) PubChem Bioassay (2010)[AID] 
Target
Name:
Ion channel NompC
Synonyms:
transient receptor potential cation channel, subfamily N, member 1
Type:
Enzyme Catalytic Domain
Mol. Mass.:
175824.78
Organism:
Danio rerio
Description:
Q7T1G6
Residue:
1614
  
Inhibitor
Name:
BDBM46814
Synonyms:
MLS000859747 [4-amino-3-(2-morpholin-4-ylethylsulfanyl)thieno[2,3-c][1,2]thiazol-5-yl]-(4-chlorophenyl)methanone [4-amino-3-[2-(4-morpholinyl)ethylthio]-5-thieno[2,3-c]isothiazolyl]-(4-chlorophenyl)methanone cid_2816887 | {4-amino-3-[(2-morpholinoethyl)sulfanyl]thieno[2,3-c]isothiazol-5-yl}(4-chlorophenyl)methanone
Type:
Small organic molecule
Emp. Form.:
C18H18ClN3O2S3
Mol. Mass.:
440.002
SMILES:
Nc1c(sc2nsc(SCCN3CCOCC3)c12)C(=O)c1ccc(Cl)cc1
: