Target
Transitional endoplasmic reticulum ATPase
Ligand
BDBM46591
Substrate
Meas. Tech.
Luminescence counterscreen assay for p97 inhibitors: Dose response biochemical high throughput screening assay to identify inhibitors of the C522A mutant p97 ATPase.
IC50
>50000±n/a nM
Citation
 PubChem, PC Luminescence counterscreen assay for p97 inhibitors: Dose response biochemical high throughput screening assay to identify inhibitors of the C522A mutant p97 ATPase. PubChem Bioassay (2009)[AID] 
Target
Name:
Transitional endoplasmic reticulum ATPase
Synonyms:
TERA_HUMAN VCP Valosin-containing protein
Type:
Enzyme
Mol. Mass.:
89300.63
Organism:
Homo sapiens (Human)
Description:
P55072
Residue:
806
  
Inhibitor
Name:
BDBM46591
Synonyms:
2-chloranyl-4-[5-[(Z)-2-[(5-methyl-1H-1,2,4-triazol-3-yl)sulfanyl]-3-oxidanyl-3-oxidanylidene-prop-1-enyl]furan-2-yl]benzoic acid 4-[5-[(Z)-2-carboxy-2-[(5-methyl-1H-1,2,4-triazol-3-yl)thio]ethenyl]-2-furanyl]-2-chlorobenzoic acid 4-{5-[(Z)-2-Carboxy-2-(5-methyl-4H-[1,2,4]triazol-3-ylsulfanyl)-vinyl]-furan-2-yl}-2-chloro-benzoic acid SMR000415298 | cid_1625680
Type:
Small organic molecule
Emp. Form.:
C17H12ClN3O5S
Mol. Mass.:
405.812
SMILES:
Cc1nnc(SC(=Cc2ccc(o2)-c2ccc(C(O)=O)c(Cl)c2)C(O)=O)[nH]1
: