Target
Transitional endoplasmic reticulum ATPase
Ligand
BDBM46592
Substrate
Meas. Tech.
Luminescence counterscreen assay for p97 inhibitors: Dose response biochemical high throughput screening assay to identify inhibitors of the C522A mutant p97 ATPase.
IC50
>50000±n/a nM
Citation
 PubChem, PC Luminescence counterscreen assay for p97 inhibitors: Dose response biochemical high throughput screening assay to identify inhibitors of the C522A mutant p97 ATPase. PubChem Bioassay (2009)[AID] 
Target
Name:
Transitional endoplasmic reticulum ATPase
Synonyms:
TERA_HUMAN VCP Valosin-containing protein
Type:
Enzyme
Mol. Mass.:
89300.63
Organism:
Homo sapiens (Human)
Description:
P55072
Residue:
806
  
Inhibitor
Name:
BDBM46592
Synonyms:
2-methyl-N-(7-methyl-4-oxidanylidene-thieno[3,2-d][1,3]thiazin-2-yl)benzamide 2-methyl-N-(7-methyl-4-oxo-4H-thieno[3,2-d][1,3]thiazin-2-yl)benzamide MLS000830202 SMR000458123 | cid_2810155
Type:
Small organic molecule
Emp. Form.:
C15H12N2O2S2
Mol. Mass.:
316.398
SMILES:
Cc1csc2c1nc(NC(=O)c1ccccc1C)sc2=O
: