Target
Mucolipin-3
Ligand
BDBM46839
Substrate
Meas. Tech.
Dose response cell-based high-throughput screening assay for agonists of the transient receptor potential channel ML3 (TRPML3)
EC50
1770±n/a nM
Citation
 PubChem, PC Dose response cell-based high-throughput screening assay for agonists of the transient receptor potential channel ML3 (TRPML3) PubChem Bioassay (2009)[AID] 
Target
Name:
Mucolipin-3
Synonyms:
MCLN3_HUMAN MCOLN3 protein
Type:
Enzyme Catalytic Domain
Mol. Mass.:
64244.09
Organism:
Homo sapiens (Human)
Description:
Q8TDD5
Residue:
553
  
Inhibitor
Name:
BDBM46839
Synonyms:
4-fluoranyl-N-[[3-(3-methylphenyl)-1,2,4-oxadiazol-5-yl]methyl]-N-propan-2-yl-benzenesulfonamide 4-fluoro-N-isopropyl-N-[[3-(m-tolyl)-1,2,4-oxadiazol-5-yl]methyl]benzenesulfonamide MLS000100209 cid_2236117
Type:
Small organic molecule
Emp. Form.:
C19H20FN3O3S
Mol. Mass.:
389.444
SMILES:
CC(C)N(Cc1nc(no1)-c1cccc(C)c1)S(=O)(=O)c1ccc(F)cc1
: