Target
Mucolipin-3
Ligand
BDBM44577
Substrate
Meas. Tech.
Dose response cell-based high-throughput screening assay for agonists of the transient receptor potential channel ML3 (TRPML3)
EC50
3390±n/a nM
Citation
 PubChem, PC Dose response cell-based high-throughput screening assay for agonists of the transient receptor potential channel ML3 (TRPML3) PubChem Bioassay (2009)[AID] 
Target
Name:
Mucolipin-3
Synonyms:
MCLN3_HUMAN MCOLN3 protein
Type:
Enzyme Catalytic Domain
Mol. Mass.:
64244.09
Organism:
Homo sapiens (Human)
Description:
Q8TDD5
Residue:
553
  
Inhibitor
Name:
BDBM44577
Synonyms:
MLS000028538 N-cyclohexyl-N-ethyl-2-methoxy-5-methyl-benzenesulfonamide SMR000058335 TRIAMCINOLONE ACETONIDE cid_6436
Type:
Small organic molecule
Emp. Form.:
C16H25NO3S
Mol. Mass.:
311.44
SMILES:
CCN(C1CCCCC1)S(=O)(=O)c1cc(C)ccc1OC
: