Target
Mucolipin-3
Ligand
BDBM42978
Substrate
Meas. Tech.
Dose response cell-based high-throughput screening assay for agonists of the transient receptor potential channel ML3 (TRPML3)
EC50
15300±n/a nM
Citation
 PubChem, PC Dose response cell-based high-throughput screening assay for agonists of the transient receptor potential channel ML3 (TRPML3) PubChem Bioassay (2009)[AID] 
Target
Name:
Mucolipin-3
Synonyms:
MCLN3_HUMAN MCOLN3 protein
Type:
Enzyme Catalytic Domain
Mol. Mass.:
64244.09
Organism:
Homo sapiens (Human)
Description:
Q8TDD5
Residue:
553
  
Inhibitor
Name:
BDBM42978
Synonyms:
(Z)-2-cyano-4-(1-prop-2-enyl-4-pyridinylidene)-2-butenoic acid ethyl ester MLS000548178 cid_6381056 ethyl 4-(1-allyl-4(1H)-pyridinylidene)-2-cyano-2-butenoate
Type:
Small organic molecule
Emp. Form.:
C15H16N2O2
Mol. Mass.:
256.2997
SMILES:
[#6]-[#6]-[#8]-[#6](=O)-[#6](=[#6]/[#6]=[#6]-1/[#6]=[#6]-[#7](-[#6]-[#6]=[#6])-[#6]=[#6]-1)\C#N
: